Trigger CI.

1 job for master in 2 minutes and 48 seconds (queued for 8 minutes and 51 seconds)
Status Name Job ID Coverage
  Build
failed build #1130

00:02:48

 
Name Stage Failure
failed
build Build
make[2]: *** [all] Error 1
Makefile:14: recipe for target 'SMP2' failed
make[1]: *** [SMP2] Error 2
make[1]: Leaving directory '/builds/taste/dmt/tests-coverage'
Makefile:35: recipe for target 'coverage' failed
make: *** [coverage] Error 1
Running after_script
Uploading artifacts for failed job
ERROR: Job failed: exit code 1